Login | Register
My pages Projects Community openCollabNet

Discussions > dev > 'make' dies @ "error: 'memset' was not declared in this scope"

subcommander
Discussion topic

Back to topic list

'make' dies @ "error: 'memset' was not declared in this scope"

Author openmacnews
Full name OpenMacNews
Date 2005-11-07 09:36:49 PST
Message -----BEGIN PGP SIGNED MESSAGE-----
Hash: RIPEMD160

Date: Sat, 05 Nov 2005 17:21:51 +0100
From: Martin Hauner <hauner at web dot de>
Content-Type: text/plain; charset=ISO-8859-15; format=flowed
Subject: ./configure not finding boost on OSX 10.4.3


hi martin,

thx for the reply.

1st, re:

      > cd boost-<version>
      > ln -s . include

thx! that did the trick.

now, after i've figured out that:
  (a) experimental-libttol in apache/subversion build is a 'bad thing', and
  (b) i need qt *3* (not 4 ...) for subcommander,

bldg subcommander, svn r1144, on OSX 10.4.3 with boost 133, config'd as:

    ./configure \
    --prefix=/usr/local/​subcommander \
    --with-qt=/usr/local/qt3 \
    --with-subversion=/u​sr/local/subversion1​3x \
    --with-apr=/usr/loca​l/apache2/bin/apr-co​nfig \
    --with-apr-util=/usr​/local/apache2/bin/a​pu-config \
    --with-neon=/usr/local/neon0254 \
    --with-ssl=/usr/local/ssl \
    --with-boost=/usr/po​rts/boost-cvs \
    --with-bdb=/usr/loca​l/berkeley-db

'make' dies at:

...
depbase=`echo ErrorImpl.o | sed 's|[^/]*$|.deps/​&|;s|\.o$||'`; \
if g++ -DHAVE_CONFIG_H -I. -I. -I.. -I/usr/local/apache2/include -I/usr/local/apache2/include
- -I/usr/local/berkele​y-db/include -I/usr/local/include -g -O2 -MT ErrorImpl.o -MD -MP -MF
"$depbase.Tpo" -c -o ErrorImpl.o ErrorImpl.cpp; \
then mv -f "$depbase.Tpo" "$depbase.Po"; else rm -f "$depbase.Tpo"; exit 1; fi
depbase=`echo File.o | sed 's|[^/]*$|.deps/​&|;s|\.o$||'`; \
if g++ -DHAVE_CONFIG_H -I. -I. -I.. -I/usr/local/apache2/include -I/usr/local/apache2/include
- -I/usr/local/berkele​y-db/include -I/usr/local/include -g -O2 -MT File.o -MD -MP -MF
"$depbase.Tpo" -c -o File.o File.cpp; \
then mv -f "$depbase.Tpo" "$depbase.Po"; else rm -f "$depbase.Tpo"; exit 1; fi
File.cpp: In constructor 'File::File(const char*, apr_pool_t*)':
File.cpp:36: error: 'memset' was not declared in this scope
File.cpp: In member function 'const sc::Error* File::mmap()':
File.cpp:73: error: 'memset' was not declared in this scope
make[2]: *** [File.o] Error 1
make[1]: *** [all-recursive] Error 1
make: *** [all] Error 2


suggestions?

thx,

richard

- --

/"\
\ / ASCII Ribbon Campaign
 X against HTML email, vCards
/ \ & micro$oft attachments

[GPG] OpenMacNews at gmail dot com
fingerprint: 780A 5C81 D446 C616 B113 AA3A 9BF4 3736 88A5 678E
-----BEGIN PGP SIGNATURE-----
Version: GnuPG v1.4.2 (Darwin)

iEYEAREDAAYFAkNvkLEA​CgkQm/Q3NoilZ47I/wCg​hEATnQOm/5ubkSwvE1e7​H214
Q6UAn3tpzRx/rD0j07fi​DP7+PUf1ggEW
=yW1a
-----END PGP SIGNATURE-----

« Previous message in topic | 1 of 18 | Next message in topic »

Messages

Show all messages in topic

'make' dies @ "error: 'memset' was not declared in this scope" openmacnews OpenMacNews 2005-11-07 09:36:49 PST
     Re: 'make' dies @ "error: 'memset' was not declared in this scope" hauner Martin Hauner 2005-11-08 02:07:09 PST
         Re: 'make' dies @ "error: 'memset' was not declared in this scope" openmacnews OpenMacNews 2005-11-08 12:09:42 PST
             Re: 'make' dies @ "error: 'memset' was not declared in this scope" hauner Martin Hauner 2005-11-09 00:24:10 PST
                 Re: 'make' dies @ "error: 'memset' was not declared in this scope" openmacnews OpenMacNews 2005-11-09 01:03:53 PST
                     Re: 'make' dies @ "error: 'memset' was not declared in this scope" hauner Martin Hauner 2005-11-09 03:07:25 PST
                         Re: 'make' dies @ "error: 'memset' was not declared in this scope" openmacnews OpenMacNews 2005-11-09 09:57:30 PST
                             Re: 'make' dies @ "error: 'memset' was not declared in this scope" hauner Martin Hauner 2005-11-10 07:50:27 PST
                             Re: 'make' dies @ "error: 'memset' was not declared in this scope" hauner Martin Hauner 2005-11-13 07:49:55 PST
                                 Re: 'make' dies @ "error: 'memset' was not declared in this scope" openmacnews OpenMacNews 2005-11-13 18:12:24 PST
                                     Re: 'make' dies @ "error: 'memset' was not declared in this scope" hauner Martin Hauner 2005-11-14 00:24:46 PST
                                         Re: 'make' dies @ "error: 'memset' was not declared in this scope" openmacnews OpenMacNews 2005-11-14 13:48:22 PST
                                             Re: 'make' dies @ "error: 'memset' was not declared in this scope" hauner Martin Hauner 2005-11-15 00:19:40 PST
                                                 Re: 'make' dies @ "error: 'memset' was not declared in this scope" openmacnews OpenMacNews 2005-11-15 00:29:28 PST
                                                     Re: 'make' dies @ "error: 'memset' was not declared in this scope" hauner Martin Hauner 2005-11-15 01:29:11 PST
                                                         Re: 'make' dies @ "error: 'memset' was not declared in this scope" openmacnews OpenMacNews 2005-11-15 09:01:01 PST
                                                             Re: 'make' dies @ "error: 'memset' was not declared in this scope" hauner Martin Hauner 2005-11-15 09:15:03 PST
                                                                 Re: 'make' dies @ "error: 'memset' was not declared in this scope" openmacnews OpenMacNews 2005-11-15 09:26:11 PST
Messages per page: