Login | Register
My pages Projects Community openCollabNet

Discussions > dev > Build of subcommander-2.0 Beta 4 fails agains subversion-1.6.2

subcommander
Discussion topic

Back to topic list

Build of subcommander-2.0 Beta 4 fails agains subversion-1.6.2

Author jschmitt
Full name Jochen Schmitt
Date 2009-05-12 09:09:47 PDT
Message Hallo,

If I'm trying to build subcommander-2.0 Beta 4 agains subversion-1.6.2
I will got
the following error messages:

depbase=`echo Diff.o | sed 's|[^/]*$|.deps/​&|;s|\.o$||'`;\
        g++ -DHAVE_CONFIG_H -I. -I.. -DLINUX=2 -D_REENTRANT
-D_GNU_SOURCE -I.. -I/usr/include/subversion-1 -I/usr/include/apr-1
-Wno-deprecated -O2 -g -pipe -Wall -Wp,-D_FOR
TIFY_SOURCE=2 -fexceptions -fstack-protector --param=ssp-buffer-size=4
-m64 -mtune=generic -MT Diff.o -MD -MP -MF $depbase.Tpo -c -o Diff.o
Diff.cpp &&\
        mv -f $depbase.Tpo $depbase.Po
CommitItem.cpp: In constructor
'svn::CommitItem::Co​mmitItem(svn_client_​commit_item_t*)':
CommitItem.cpp:31: error: invalid use of incomplete type 'struct svn_prop_t'
Property.h:20: error: forward declaration of 'struct svn_prop_t'
make[3]: *** [CommitItem.o] Error 1
make[3]: *** Waiting for unfinished jobs....

It will be nice, if anyone have a hint to solve this issue.

Best Regards:

Jochen Schmitt

« Previous message in topic | 1 of 4 | Next message in topic »

Messages

Show all messages in topic

Build of subcommander-2.0 Beta 4 fails agains subversion-1.6.2 jschmitt Jochen Schmitt 2009-05-12 09:09:47 PDT
     Re: Build of subcommander-2.0 Beta 4 fails agains subversion-1.6.2 hauner Martin Hauner 2009-05-12 11:53:27 PDT
     Re: Build of subcommander-2.0 Beta 4 fails agains subversion-1.6.2 hauner Martin Hauner 2009-05-13 12:22:52 PDT
         Re: Build of subcommander-2.0 Beta 4 fails agains subversion-1.6.2 jschmitt Jochen Schmitt 2009-05-13 13:08:09 PDT
Messages per page: